{"text_format":"1","workbook":"xlsx","n_sheets":4,"sheets":["Clasificación","Puntos","Socios","Carreras"],"not_rendered":{"charts":0,"images":1,"macros":1,"external_links":0,"defined_names":0,"comments":0,"pivot_tables":0},"unopened":[],"bounds":{"document_bytes":16777216,"sheet_cells":100000,"rows_first":2000,"rows_last":500,"rows_between":2000,"halvings":0,"cell_chars":16384,"cell_head_chars":4096},"cells_cut":0,"cells_raw":0,"read":"whole","date_system":"1900"}

{"sheet":"Clasificación","index":0,"n_rows":103,"n_cols":24,"rows_kept":103,"cut":false,"hidden":false,"merged":[[0,0,0,23],[1,4,1,5],[1,6,1,7],[1,8,1,9],[1,10,1,11],[1,14,1,15],[1,12,1,13],[1,16,1,17],[1,18,1,19],[1,20,1,21]]}
["CAMPEONATO DE PRUEBA"]
[null,null,null,null,"1ª Prueba",null,"2ª Prueba",null,"3ª Prueba",null,"4ª Prueba",null,"5ª Prueba",null,"6ª Prueba",null,"7ª Prueba",null,"8ª Prueba",null,"Asistencia"]
["Ord","Lic","Piloto","Región","Pos","Puntos","Pos","Puntos","Pos","Puntos","Pos","Puntos","Pos","Puntos","Pos","Puntos","Pos","Puntos","Pos","Puntos","nº","Puntos","TOTAL","Netos"]
[1,{"$f":"IF(Carreras!$K2=0,\"\",Carreras!$K2)","v":""},{"$f":"IF(B4=\"\",\"\",_xlfn.XLOOKUP(B4,Socios!A:A,Socios!B:B,FALSE,0,1))","v":""},{"$f":"IF(B4=\"\",\"\",_xlfn.XLOOKUP(B4,Socios!A:A,Socios!C:C,FALSE,0,1))","v":""},{"$f":"IF($B4=\"\",\"\",_xlfn.XLOOKUP($B4,Carreras!$B:$B,Carreras!$A:$A,0,0,1))","v":""},{"$f":"IF($B4=\"\",\"\",IF($E4=0,0,_xlfn.XLOOKUP($E4,Puntos!A:A,Puntos!B:B,TRUE)))","v":""},{"$f":"IF($B4=\"\",\"\",_xlfn.XLOOKUP($B4,Carreras!C:C,Carreras!A:A,0,0,1))","v":""},{"$f":"IF($B4=\"\",\"\",IF($G4=0,0,_xlfn.XLOOKUP($G4,Puntos!A:A,Puntos!B:B,TRUE)))","v":""},{"$f":"IF($B4=\"\",\"\",_xlfn.XLOOKUP($B4,Carreras!$D:$D,Carreras!$A:$A,0,0,1))","v":""},{"$f":"IF($B4=\"\",\"\",IF($I4=0,0,_xlfn.XLOOKUP($I4,Puntos!A:A,Puntos!B:B,TRUE)))","v":""},{"$f":"IF($B4=\"\",\"\",_xlfn.XLOOKUP($B4,Carreras!$E:$E,Carreras!$A:$A,0,0,1))","v":""},{"$f":"IF($B4=\"\",\"\",IF($K4=0,0,_xlfn.XLOOKUP($K4,Puntos!$A:$A,Puntos!$B:$B)))","v":""},{"$f":"IF($B4=\"\",\"\",_xlfn.XLOOKUP($B4,Carreras!F:F,Carreras!$A:$A,0,0,1))","v":""},{"$f":"IF($B4=\"\",\"\",IF($M4=0,0,_xlfn.XLOOKUP(M4,Puntos!A:A,Puntos!B:B,TRUE)))","v":""},{"$f":"IF($B4=\"\",\"\",_xlfn.XLOOKUP($B4,Carreras!$G:$G,Carreras!$A:$A,0,0,1))","v":""},{"$f":"IF($B4=\"\",\"\",IF($O4=0,0,_xlfn.XLOOKUP($O4,Puntos!A:A,Puntos!B:B,TRUE)))","v":""},{"$f":"IF($B4=\"\",\"\",_xlfn.XLOOKUP($B4,Carreras!$H:$H,Carreras!$A:$A,0,0,1))","v":""},{"$f":"IF($B4=\"\",\"\",IF($Q4=0,0,_xlfn.XLOOKUP($Q4,Puntos!A:A,Puntos!B:B,TRUE)))","v":""},{"$f":"IF($B4=\"\",\"\",_xlfn.XLOOKUP($B4,Carreras!$I:$I,Carreras!$A:$A,0,0,1))","v":""},{"$f":"IF($B4=\"\",\"\",IF($S4=0,0,_xlfn.XLOOKUP($S4,Puntos!A:A,Puntos!B:B,TRUE)))","v":""},{"$f":"IF($B4=\"\",\"\",COUNTIF(F4,\">0\")+COUNTIF(H4,\">0\")+COUNTIF(J4,\">0\")+COUNTIF(L4,\">0\")+COUNTIF(N4,\">0\")*COUNTIF(P4,\">0\")+COUNTIF(R4,\">0\")+COUNTIF(T4,\"\">0))","v":""},{"$f":"IF($B4=\"\",\"\",_xlfn.IFS(U4=0,0,U4=1,0,U4=2,50,U4=3,100,U4=4,150,U4=5,200,U4=6,250,U4=7,300,U4=8,350))","v":""},{"$f":"IF(B4=\"\",\"\",F4+H4+J4+L4+P4+N4+R4+T4+V4)","v":""},{"$f":"IF(B4=\"\",0,W4-MIN(F4,H4,J4,L4,N4,P4,R4,T4))","v":0}]
[{"$f":"A4+1","v":2},{"$f":"IF(Carreras!$K3=0,\"\",Carreras!$K3)","v":""},{"$f":"IF(B5=\"\",\"\",_xlfn.XLOOKUP(B5,Socios!A:A,Socios!B:B,FALSE,0,1))","v":""},{"$f":"IF(B5=\"\",\"\",_xlfn.XLOOKUP(B5,Socios!A:A,Socios!C:C,FALSE,0,1))","v":""},{"$f":"IF($B5=\"\",\"\",_xlfn.XLOOKUP($B5,Carreras!$B:$B,Carreras!$A:$A,0,0,1))","v":""},{"$f":"IF($B5=\"\",\"\",IF($E5=0,0,_xlfn.XLOOKUP($E5,Puntos!A:A,Puntos!B:B,TRUE)))","v":""},{"$f":"IF($B5=\"\",\"\",_xlfn.XLOOKUP($B5,Carreras!C:C,Carreras!A:A,0,0,1))","v":""},{"$f":"IF($B5=\"\",\"\",IF($G5=0,0,_xlfn.XLOOKUP($G5,Puntos!A:A,Puntos!B:B,TRUE)))","v":""},{"$f":"IF($B5=\"\",\"\",_xlfn.XLOOKUP($B5,Carreras!$D:$D,Carreras!$A:$A,0,0,1))","v":""},{"$f":"IF($B5=\"\",\"\",IF($I5=0,0,_xlfn.XLOOKUP($I5,Puntos!A:A,Puntos!B:B,TRUE)))","v":""},{"$f":"IF($B5=\"\",\"\",_xlfn.XLOOKUP($B5,Carreras!$E:$E,Carreras!$A:$A,0,0,1))","v":""},{"$f":"IF($B5=\"\",\"\",IF($K5=0,0,_xlfn.XLOOKUP($K5,Puntos!$A:$A,Puntos!$B:$B)))","v":""},{"$f":"IF($B5=\"\",\"\",_xlfn.XLOOKUP($B5,Carreras!F:F,Carreras!$A:$A,0,0,1))","v":""},{"$f":"IF($B5=\"\",\"\",IF($M5=0,0,_xlfn.XLOOKUP(M5,Puntos!A:A,Puntos!B:B,TRUE)))","v":""},{"$f":"IF($B5=\"\",\"\",_xlfn.XLOOKUP($B5,Carreras!$G:$G,Carreras!$A:$A,0,0,1))","v":""},{"$f":"IF($B5=\"\",\"\",IF($O5=0,0,_xlfn.XLOOKUP($O5,Puntos!A:A,Puntos!B:B,TRUE)))","v":""},{"$f":"IF($B5=\"\",\"\",_xlfn.XLOOKUP($B5,Carreras!$H:$H,Carreras!$A:$A,0,0,1))","v":""},{"$f":"IF($B5=\"\",\"\",IF($Q5=0,0,_xlfn.XLOOKUP($Q5,Puntos!A:A,Puntos!B:B,TRUE)))","v":""},{"$f":"IF($B5=\"\",\"\",_xlfn.XLOOKUP($B5,Carreras!$I:$I,Carreras!$A:$A,0,0,1))","v":""},{"$f":"IF($B5=\"\",\"\",IF($S5=0,0,_xlfn.XLOOKUP($S5,Puntos!A:A,Puntos!B:B,TRUE)))","v":""},"",{"$f":"IF($B5=\"\",\"\",_xlfn.IFS(U5=0,0,U5=1,0,U5=2,50,U5=3,100,U5=4,150,U5=5,200,U5=6,250,U5=7,300,U5=8,350))","v":""},"",0]
[{"$f":"A5+1","v":3},{"$f":"IF(Carreras!$K4=0,\"\",Carreras!$K4)","v":""},{"$f":"IF(B6=\"\",\"\",_xlfn.XLOOKUP(B6,Socios!A:A,Socios!B:B,FALSE,0,1))","v":""},{"$f":"IF(B6=\"\",\"\",_xlfn.XLOOKUP(B6,Socios!A:A,Socios!C:C,FALSE,0,1))","v":""},{"$f":"IF($B6=\"\",\"\",_xlfn.XLOOKUP($B6,Carreras!$B:$B,Carreras!$A:$A,0,0,1))","v":""},{"$f":"IF($B6=\"\",\"\",IF($E6=0,0,_xlfn.XLOOKUP($E6,Puntos!A:A,Puntos!B:B,TRUE)))","v":""},{"$f":"IF($B6=\"\",\"\",_xlfn.XLOOKUP($B6,Carreras!C:C,Carreras!A:A,0,0,1))","v":""},{"$f":"IF($B6=\"\",\"\",IF($G6=0,0,_xlfn.XLOOKUP($G6,Puntos!A:A,Puntos!B:B,TRUE)))","v":""},{"$f":"IF($B6=\"\",\"\",_xlfn.XLOOKUP($B6,Carreras!$D:$D,Carreras!$A:$A,0,0,1))","v":""},{"$f":"IF($B6=\"\",\"\",IF($I6=0,0,_xlfn.XLOOKUP($I6,Puntos!A:A,Puntos!B:B,TRUE)))","v":""},{"$f":"IF($B6=\"\",\"\",_xlfn.XLOOKUP($B6,Carreras!$E:$E,Carreras!$A:$A,0,0,1))","v":""},{"$f":"IF($B6=\"\",\"\",IF($K6=0,0,_xlfn.XLOOKUP($K6,Puntos!$A:$A,Puntos!$B:$B)))","v":""},{"$f":"IF($B6=\"\",\"\",_xlfn.XLOOKUP($B6,Carreras!F:F,Carreras!$A:$A,0,0,1))","v":""},{"$f":"IF($B6=\"\",\"\",IF($M6=0,0,_xlfn.XLOOKUP(M6,Puntos!A:A,Puntos!B:B,TRUE)))","v":""},{"$f":"IF($B6=\"\",\"\",_xlfn.XLOOKUP($B6,Carreras!$G:$G,Carreras!$A:$A,0,0,1))","v":""},{"$f":"IF($B6=\"\",\"\",IF($O6=0,0,_xlfn.XLOOKUP($O6,Puntos!A:A,Puntos!B:B,TRUE)))","v":""},{"$f":"IF($B6=\"\",\"\",_xlfn.XLOOKUP($B6,Carreras!$H:$H,Carreras!$A:$A,0,0,1))","v":""},{"$f":"IF($B6=\"\",\"\",IF($Q6=0,0,_xlfn.XLOOKUP($Q6,Puntos!A:A,Puntos!B:B,TRUE)))","v":""},{"$f":"IF($B6=\"\",\"\",_xlfn.XLOOKUP($B6,Carreras!$I:$I,Carreras!$A:$A,0,0,1))","v":""},{"$f":"IF($B6=\"\",\"\",IF($S6=0,0,_xlfn.XLOOKUP($S6,Puntos!A:A,Puntos!B:B,TRUE)))","v":""},"",{"$f":"IF($B6=\"\",\"\",_xlfn.IFS(U6=0,0,U6=1,0,U6=2,50,U6=3,100,U6=4,150,U6=5,200,U6=6,250,U6=7,300,U6=8,350))","v":""},"",0]
[4,{"$f":"IF(Carreras!$K6=0,\"\",Carreras!$K6)","v":""},{"$f":"IF(B7=\"\",\"\",_xlfn.XLOOKUP(B7,Socios!A:A,Socios!B:B,FALSE,0,1))","v":""},{"$f":"IF(B7=\"\",\"\",_xlfn.XLOOKUP(B7,Socios!A:A,Socios!C:C,FALSE,0,1))","v":""},{"$f":"IF($B7=\"\",\"\",_xlfn.XLOOKUP($B7,Carreras!$B:$B,Carreras!$A:$A,0,0,1))","v":""},{"$f":"IF($B7=\"\",\"\",IF($E7=0,0,_xlfn.XLOOKUP($E7,Puntos!A:A,Puntos!B:B,TRUE)))","v":""},{"$f":"IF($B7=\"\",\"\",_xlfn.XLOOKUP($B7,Carreras!C:C,Carreras!A:A,0,0,1))","v":""},{"$f":"IF($B7=\"\",\"\",IF($G7=0,0,_xlfn.XLOOKUP($G7,Puntos!A:A,Puntos!B:B,TRUE)))","v":""},{"$f":"IF($B7=\"\",\"\",_xlfn.XLOOKUP($B7,Carreras!$D:$D,Carreras!$A:$A,0,0,1))","v":""},{"$f":"IF($B7=\"\",\"\",IF($I7=0,0,_xlfn.XLOOKUP($I7,Puntos!A:A,Puntos!B:B,TRUE)))","v":""},{"$f":"IF($B7=\"\",\"\",_xlfn.XLOOKUP($B7,Carreras!$E:$E,Carreras!$A:$A,0,0,1))","v":""},{"$f":"IF($B7=\"\",\"\",IF($K7=0,0,_xlfn.XLOOKUP($K7,Puntos!$A:$A,Puntos!$B:$B)))","v":""},{"$f":"IF($B7=\"\",\"\",_xlfn.XLOOKUP($B7,Carreras!F:F,Carreras!$A:$A,0,0,1))","v":""},{"$f":"IF($B7=\"\",\"\",IF($M7=0,0,_xlfn.XLOOKUP(M7,Puntos!A:A,Puntos!B:B,TRUE)))","v":""},{"$f":"IF($B7=\"\",\"\",_xlfn.XLOOKUP($B7,Carreras!$G:$G,Carreras!$A:$A,0,0,1))","v":""},{"$f":"IF($B7=\"\",\"\",IF($O7=0,0,_xlfn.XLOOKUP($O7,Puntos!A:A,Puntos!B:B,TRUE)))","v":""},{"$f":"IF($B7=\"\",\"\",_xlfn.XLOOKUP($B7,Carreras!$H:$H,Carreras!$A:$A,0,0,1))","v":""},{"$f":"IF($B7=\"\",\"\",IF($Q7=0,0,_xlfn.XLOOKUP($Q7,Puntos!A:A,Puntos!B:B,TRUE)))","v":""},{"$f":"IF($B7=\"\",\"\",_xlfn.XLOOKUP($B7,Carreras!$I:$I,Carreras!$A:$A,0,0,1))","v":""},{"$f":"IF($B7=\"\",\"\",IF($S7=0,0,_xlfn.XLOOKUP($S7,Puntos!A:A,Puntos!B:B,TRUE)))","v":""},"",{"$f":"IF($B7=\"\",\"\",_xlfn.IFS(U7=0,0,U7=1,0,U7=2,50,U7=3,100,U7=4,150,U7=5,200,U7=6,250,U7=7,300,U7=8,350))","v":""},"",0]
[5,{"$f":"IF(Carreras!$K7=0,\"\",Carreras!$K7)","v":""},{"$f":"IF(B8=\"\",\"\",_xlfn.XLOOKUP(B8,Socios!A:A,Socios!B:B,FALSE,0,1))","v":""},{"$f":"IF(B8=\"\",\"\",_xlfn.XLOOKUP(B8,Socios!A:A,Socios!C:C,FALSE,0,1))","v":""},{"$f":"IF($B8=\"\",\"\",_xlfn.XLOOKUP($B8,Carreras!$B:$B,Carreras!$A:$A,0,0,1))","v":""},{"$f":"IF($B8=\"\",\"\",IF($E8=0,0,_xlfn.XLOOKUP($E8,Puntos!A:A,Puntos!B:B,TRUE)))","v":""},{"$f":"IF($B8=\"\",\"\",_xlfn.XLOOKUP($B8,Carreras!C:C,Carreras!A:A,0,0,1))","v":""},{"$f":"IF($B8=\"\",\"\",IF($G8=0,0,_xlfn.XLOOKUP($G8,Puntos!A:A,Puntos!B:B,TRUE)))","v":""},{"$f":"IF($B8=\"\",\"\",_xlfn.XLOOKUP($B8,Carreras!$D:$D,Carreras!$A:$A,0,0,1))","v":""},{"$f":"IF($B8=\"\",\"\",IF($I8=0,0,_xlfn.XLOOKUP($I8,Puntos!A:A,Puntos!B:B,TRUE)))","v":""},{"$f":"IF($B8=\"\",\"\",_xlfn.XLOOKUP($B8,Carreras!$E:$E,Carreras!$A:$A,0,0,1))","v":""},{"$f":"IF($B8=\"\",\"\",IF($K8=0,0,_xlfn.XLOOKUP($K8,Puntos!$A:$A,Puntos!$B:$B)))","v":""},{"$f":"IF($B8=\"\",\"\",_xlfn.XLOOKUP($B8,Carreras!F:F,Carreras!$A:$A,0,0,1))","v":""},{"$f":"IF($B8=\"\",\"\",IF($M8=0,0,_xlfn.XLOOKUP(M8,Puntos!A:A,Puntos!B:B,TRUE)))","v":""},{"$f":"IF($B8=\"\",\"\",_xlfn.XLOOKUP($B8,Carreras!$G:$G,Carreras!$A:$A,0,0,1))","v":""},{"$f":"IF($B8=\"\",\"\",IF($O8=0,0,_xlfn.XLOOKUP($O8,Puntos!A:A,Puntos!B:B,TRUE)))","v":""},{"$f":"IF($B8=\"\",\"\",_xlfn.XLOOKUP($B8,Carreras!$H:$H,Carreras!$A:$A,0,0,1))","v":""},{"$f":"IF($B8=\"\",\"\",IF($Q8=0,0,_xlfn.XLOOKUP($Q8,Puntos!A:A,Puntos!B:B,TRUE)))","v":""},{"$f":"IF($B8=\"\",\"\",_xlfn.XLOOKUP($B8,Carreras!$I:$I,Carreras!$A:$A,0,0,1))","v":""},{"$f":"IF($B8=\"\",\"\",IF($S8=0,0,_xlfn.XLOOKUP($S8,Puntos!A:A,Puntos!B:B,TRUE)))","v":""},"",{"$f":"IF($B8=\"\",\"\",_xlfn.IFS(U8=0,0,U8=1,0,U8=2,50,U8=3,100,U8=4,150,U8=5,200,U8=6,250,U8=7,300,U8=8,350))","v":""},"",0]
[6,{"$f":"IF(Carreras!$K5=0,\"\",Carreras!$K5)","v":""},{"$f":"IF(B9=\"\",\"\",_xlfn.XLOOKUP(B9,Socios!A:A,Socios!B:B,FALSE,0,1))","v":""},{"$f":"IF(B9=\"\",\"\",_xlfn.XLOOKUP(B9,Socios!A:A,Socios!C:C,FALSE,0,1))","v":""},{"$f":"IF($B9=\"\",\"\",_xlfn.XLOOKUP($B9,Carreras!$B:$B,Carreras!$A:$A,0,0,1))","v":""},{"$f":"IF($B9=\"\",\"\",IF($E9=0,0,_xlfn.XLOOKUP($E9,Puntos!A:A,Puntos!B:B,TRUE)))","v":""},{"$f":"IF($B9=\"\",\"\",_xlfn.XLOOKUP($B9,Carreras!C:C,Carreras!A:A,0,0,1))","v":""},{"$f":"IF($B9=\"\",\"\",IF($G9=0,0,_xlfn.XLOOKUP($G9,Puntos!A:A,Puntos!B:B,TRUE)))","v":""},{"$f":"IF($B9=\"\",\"\",_xlfn.XLOOKUP($B9,Carreras!$D:$D,Carreras!$A:$A,0,0,1))","v":""},{"$f":"IF($B9=\"\",\"\",IF($I9=0,0,_xlfn.XLOOKUP($I9,Puntos!A:A,Puntos!B:B,TRUE)))","v":""},{"$f":"IF($B9=\"\",\"\",_xlfn.XLOOKUP($B9,Carreras!$E:$E,Carreras!$A:$A,0,0,1))","v":""},{"$f":"IF($B9=\"\",\"\",IF($K9=0,0,_xlfn.XLOOKUP($K9,Puntos!$A:$A,Puntos!$B:$B)))","v":""},{"$f":"IF($B9=\"\",\"\",_xlfn.XLOOKUP($B9,Carreras!F:F,Carreras!$A:$A,0,0,1))","v":""},{"$f":"IF($B9=\"\",\"\",IF($M9=0,0,_xlfn.XLOOKUP(M9,Puntos!A:A,Puntos!B:B,TRUE)))","v":""},{"$f":"IF($B9=\"\",\"\",_xlfn.XLOOKUP($B9,Carreras!$G:$G,Carreras!$A:$A,0,0,1))","v":""},{"$f":"IF($B9=\"\",\"\",IF($O9=0,0,_xlfn.XLOOKUP($O9,Puntos!A:A,Puntos!B:B,TRUE)))","v":""},{"$f":"IF($B9=\"\",\"\",_xlfn.XLOOKUP($B9,Carreras!$H:$H,Carreras!$A:$A,0,0,1))","v":""},{"$f":"IF($B9=\"\",\"\",IF($Q9=0,0,_xlfn.XLOOKUP($Q9,Puntos!A:A,Puntos!B:B,TRUE)))","v":""},{"$f":"IF($B9=\"\",\"\",_xlfn.XLOOKUP($B9,Carreras!$I:$I,Carreras!$A:$A,0,0,1))","v":""},{"$f":"IF($B9=\"\",\"\",IF($S9=0,0,_xlfn.XLOOKUP($S9,Puntos!A:A,Puntos!B:B,TRUE)))","v":""},"",{"$f":"IF($B9=\"\",\"\",_xlfn.IFS(U9=0,0,U9=1,0,U9=2,50,U9=3,100,U9=4,150,U9=5,200,U9=6,250,U9=7,300,U9=8,350))","v":""},"",0]
[7,{"$f":"IF(Carreras!$K8=0,\"\",Carreras!$K8)","v":""},{"$f":"IF(B10=\"\",\"\",_xlfn.XLOOKUP(B10,Socios!A:A,Socios!B:B,FALSE,0,1))","v":""},{"$f":"IF(B10=\"\",\"\",_xlfn.XLOOKUP(B10,Socios!A:A,Socios!C:C,FALSE,0,1))","v":""},{"$f":"IF($B10=\"\",\"\",_xlfn.XLOOKUP($B10,Carreras!$B:$B,Carreras!$A:$A,0,0,1))","v":""},{"$f":"IF($B10=\"\",\"\",IF($E10=0,0,_xlfn.XLOOKUP($E10,Puntos!A:A,Puntos!B:B,TRUE)))","v":""},{"$f":"IF($B10=\"\",\"\",_xlfn.XLOOKUP($B10,Carreras!C:C,Carreras!A:A,0,0,1))","v":""},{"$f":"IF($B10=\"\",\"\",IF($G10=0,0,_xlfn.XLOOKUP($G10,Puntos!A:A,Puntos!B:B,TRUE)))","v":""},{"$f":"IF($B10=\"\",\"\",_xlfn.XLOOKUP($B10,Carreras!$D:$D,Carreras!$A:$A,0,0,1))","v":""},{"$f":"IF($B10=\"\",\"\",IF($I10=0,0,_xlfn.XLOOKUP($I10,Puntos!A:A,Puntos!B:B,TRUE)))","v":""},{"$f":"IF($B10=\"\",\"\",_xlfn.XLOOKUP($B10,Carreras!$E:$E,Carreras!$A:$A,0,0,1))","v":""},{"$f":"IF($B10=\"\",\"\",IF($K10=0,0,_xlfn.XLOOKUP($K10,Puntos!$A:$A,Puntos!$B:$B)))","v":""},{"$f":"IF($B10=\"\",\"\",_xlfn.XLOOKUP($B10,Carreras!F:F,Carreras!$A:$A,0,0,1))","v":""},{"$f":"IF($B10=\"\",\"\",IF($M10=0,0,_xlfn.XLOOKUP(M10,Puntos!A:A,Puntos!B:B,TRUE)))","v":""},{"$f":"IF($B10=\"\",\"\",_xlfn.XLOOKUP($B10,Carreras!$G:$G,Carreras!$A:$A,0,0,1))","v":""},{"$f":"IF($B10=\"\",\"\",IF($O10=0,0,_xlfn.XLOOKUP($O10,Puntos!A:A,Puntos!B:B,TRUE)))","v":""},{"$f":"IF($B10=\"\",\"\",_xlfn.XLOOKUP($B10,Carreras!$H:$H,Carreras!$A:$A,0,0,1))","v":""},{"$f":"IF($B10=\"\",\"\",IF($Q10=0,0,_xlfn.XLOOKUP($Q10,Puntos!A:A,Puntos!B:B,TRUE)))","v":""},{"$f":"IF($B10=\"\",\"\",_xlfn.XLOOKUP($B10,Carreras!$I:$I,Carreras!$A:$A,0,0,1))","v":""},{"$f":"IF($B10=\"\",\"\",IF($S10=0,0,_xlfn.XLOOKUP($S10,Puntos!A:A,Puntos!B:B,TRUE)))","v":""},"",{"$f":"IF($B10=\"\",\"\",_xlfn.IFS(U10=0,0,U10=1,0,U10=2,50,U10=3,100,U10=4,150,U10=5,200,U10=6,250,U10=7,300,U10=8,350))","v":""},"",0]
[8,{"$f":"IF(Carreras!$K9=0,\"\",Carreras!$K9)","v":""},{"$f":"IF(B11=\"\",\"\",_xlfn.XLOOKUP(B11,Socios!A:A,Socios!B:B,FALSE,0,1))","v":""},{"$f":"IF(B11=\"\",\"\",_xlfn.XLOOKUP(B11,Socios!A:A,Socios!C:C,FALSE,0,1))","v":""},{"$f":"IF($B11=\"\",\"\",_xlfn.XLOOKUP($B11,Carreras!$B:$B,Carreras!$A:$A,0,0,1))","v":""},{"$f":"IF($B11=\"\",\"\",IF($E11=0,0,_xlfn.XLOOKUP($E11,Puntos!A:A,Puntos!B:B,TRUE)))","v":""},{"$f":"IF($B11=\"\",\"\",_xlfn.XLOOKUP($B11,Carreras!C:C,Carreras!A:A,0,0,1))","v":""},{"$f":"IF($B11=\"\",\"\",IF($G11=0,0,_xlfn.XLOOKUP($G11,Puntos!A:A,Puntos!B:B,TRUE)))","v":""},{"$f":"IF($B11=\"\",\"\",_xlfn.XLOOKUP($B11,Carreras!$D:$D,Carreras!$A:$A,0,0,1))","v":""},{"$f":"IF($B11=\"\",\"\",IF($I11=0,0,_xlfn.XLOOKUP($I11,Puntos!A:A,Puntos!B:B,TRUE)))","v":""},{"$f":"IF($B11=\"\",\"\",_xlfn.XLOOKUP($B11,Carreras!$E:$E,Carreras!$A:$A,0,0,1))","v":""},{"$f":"IF($B11=\"\",\"\",IF($K11=0,0,_xlfn.XLOOKUP($K11,Puntos!$A:$A,Puntos!$B:$B)))","v":""},{"$f":"IF($B11=\"\",\"\",_xlfn.XLOOKUP($B11,Carreras!F:F,Carreras!$A:$A,0,0,1))","v":""},{"$f":"IF($B11=\"\",\"\",IF($M11=0,0,_xlfn.XLOOKUP(M11,Puntos!A:A,Puntos!B:B,TRUE)))","v":""},{"$f":"IF($B11=\"\",\"\",_xlfn.XLOOKUP($B11,Carreras!$G:$G,Carreras!$A:$A,0,0,1))","v":""},{"$f":"IF($B11=\"\",\"\",IF($O11=0,0,_xlfn.XLOOKUP($O11,Puntos!A:A,Puntos!B:B,TRUE)))","v":""},{"$f":"IF($B11=\"\",\"\",_xlfn.XLOOKUP($B11,Carreras!$H:$H,Carreras!$A:$A,0,0,1))","v":""},{"$f":"IF($B11=\"\",\"\",IF($Q11=0,0,_xlfn.XLOOKUP($Q11,Puntos!A:A,Puntos!B:B,TRUE)))","v":""},{"$f":"IF($B11=\"\",\"\",_xlfn.XLOOKUP($B11,Carreras!$I:$I,Carreras!$A:$A,0,0,1))","v":""},{"$f":"IF($B11=\"\",\"\",IF($S11=0,0,_xlfn.XLOOKUP($S11,Puntos!A:A,Puntos!B:B,TRUE)))","v":""},"",{"$f":"IF($B11=\"\",\"\",_xlfn.IFS(U11=0,0,U11=1,0,U11=2,50,U11=3,100,U11=4,150,U11=5,200,U11=6,250,U11=7,300,U11=8,350))","v":""},"",0]
[9,{"$f":"IF(Carreras!$K10=0,\"\",Carreras!$K10)","v":""},{"$f":"IF(B12=\"\",\"\",_xlfn.XLOOKUP(B12,Socios!A:A,Socios!B:B,FALSE,0,1))","v":""},{"$f":"IF(B12=\"\",\"\",_xlfn.XLOOKUP(B12,Socios!A:A,Socios!C:C,FALSE,0,1))","v":""},{"$f":"IF($B12=\"\",\"\",_xlfn.XLOOKUP($B12,Carreras!$B:$B,Carreras!$A:$A,0,0,1))","v":""},{"$f":"IF($B12=\"\",\"\",IF($E12=0,0,_xlfn.XLOOKUP($E12,Puntos!A:A,Puntos!B:B,TRUE)))","v":""},{"$f":"IF($B12=\"\",\"\",_xlfn.XLOOKUP($B12,Carreras!C:C,Carreras!A:A,0,0,1))","v":""},{"$f":"IF($B12=\"\",\"\",IF($G12=0,0,_xlfn.XLOOKUP($G12,Puntos!A:A,Puntos!B:B,TRUE)))","v":""},{"$f":"IF($B12=\"\",\"\",_xlfn.XLOOKUP($B12,Carreras!$D:$D,Carreras!$A:$A,0,0,1))","v":""},{"$f":"IF($B12=\"\",\"\",IF($I12=0,0,_xlfn.XLOOKUP($I12,Puntos!A:A,Puntos!B:B,TRUE)))","v":""},{"$f":"IF($B12=\"\",\"\",_xlfn.XLOOKUP($B12,Carreras!$E:$E,Carreras!$A:$A,0,0,1))","v":""},{"$f":"IF($B12=\"\",\"\",IF($K12=0,0,_xlfn.XLOOKUP($K12,Puntos!$A:$A,Puntos!$B:$B)))","v":""},{"$f":"IF($B12=\"\",\"\",_xlfn.XLOOKUP($B12,Carreras!F:F,Carreras!$A:$A,0,0,1))","v":""},{"$f":"IF($B12=\"\",\"\",IF($M12=0,0,_xlfn.XLOOKUP(M12,Puntos!A:A,Puntos!B:B,TRUE)))","v":""},{"$f":"IF($B12=\"\",\"\",_xlfn.XLOOKUP($B12,Carreras!$G:$G,Carreras!$A:$A,0,0,1))","v":""},{"$f":"IF($B12=\"\",\"\",IF($O12=0,0,_xlfn.XLOOKUP($O12,Puntos!A:A,Puntos!B:B,TRUE)))","v":""},{"$f":"IF($B12=\"\",\"\",_xlfn.XLOOKUP($B12,Carreras!$H:$H,Carreras!$A:$A,0,0,1))","v":""},{"$f":"IF($B12=\"\",\"\",IF($Q12=0,0,_xlfn.XLOOKUP($Q12,Puntos!A:A,Puntos!B:B,TRUE)))","v":""},{"$f":"IF($B12=\"\",\"\",_xlfn.XLOOKUP($B12,Carreras!$I:$I,Carreras!$A:$A,0,0,1))","v":""},{"$f":"IF($B12=\"\",\"\",IF($S12=0,0,_xlfn.XLOOKUP($S12,Puntos!A:A,Puntos!B:B,TRUE)))","v":""},"",{"$f":"IF($B12=\"\",\"\",_xlfn.IFS(U12=0,0,U12=1,0,U12=2,50,U12=3,100,U12=4,150,U12=5,200,U12=6,250,U12=7,300,U12=8,350))","v":""},"",0]
[10,{"$f":"IF(Carreras!$K11=0,\"\",Carreras!$K11)","v":""},{"$f":"IF(B13=\"\",\"\",_xlfn.XLOOKUP(B13,Socios!A:A,Socios!B:B,FALSE,0,1))","v":""},{"$f":"IF(B13=\"\",\"\",_xlfn.XLOOKUP(B13,Socios!A:A,Socios!C:C,FALSE,0,1))","v":""},{"$f":"IF($B13=\"\",\"\",_xlfn.XLOOKUP($B13,Carreras!$B:$B,Carreras!$A:$A,0,0,1))","v":""},{"$f":"IF($B13=\"\",\"\",IF($E13=0,0,_xlfn.XLOOKUP($E13,Puntos!A:A,Puntos!B:B,TRUE)))","v":""},{"$f":"IF($B13=\"\",\"\",_xlfn.XLOOKUP($B13,Carreras!C:C,Carreras!A:A,0,0,1))","v":""},{"$f":"IF($B13=\"\",\"\",IF($G13=0,0,_xlfn.XLOOKUP($G13,Puntos!A:A,Puntos!B:B,TRUE)))","v":""},{"$f":"IF($B13=\"\",\"\",_xlfn.XLOOKUP($B13,Carreras!$D:$D,Carreras!$A:$A,0,0,1))","v":""},{"$f":"IF($B13=\"\",\"\",IF($I13=0,0,_xlfn.XLOOKUP($I13,Puntos!A:A,Puntos!B:B,TRUE)))","v":""},{"$f":"IF($B13=\"\",\"\",_xlfn.XLOOKUP($B13,Carreras!$E:$E,Carreras!$A:$A,0,0,1))","v":""},{"$f":"IF($B13=\"\",\"\",IF($K13=0,0,_xlfn.XLOOKUP($K13,Puntos!$A:$A,Puntos!$B:$B)))","v":""},{"$f":"IF($B13=\"\",\"\",_xlfn.XLOOKUP($B13,Carreras!F:F,Carreras!$A:$A,0,0,1))","v":""},{"$f":"IF($B13=\"\",\"\",IF($M13=0,0,_xlfn.XLOOKUP(M13,Puntos!A:A,Puntos!B:B,TRUE)))","v":""},{"$f":"IF($B13=\"\",\"\",_xlfn.XLOOKUP($B13,Carreras!$G:$G,Carreras!$A:$A,0,0,1))","v":""},{"$f":"IF($B13=\"\",\"\",IF($O13=0,0,_xlfn.XLOOKUP($O13,Puntos!A:A,Puntos!B:B,TRUE)))","v":""},{"$f":"IF($B13=\"\",\"\",_xlfn.XLOOKUP($B13,Carreras!$H:$H,Carreras!$A:$A,0,0,1))","v":""},{"$f":"IF($B13=\"\",\"\",IF($Q13=0,0,_xlfn.XLOOKUP($Q13,Puntos!A:A,Puntos!B:B,TRUE)))","v":""},{"$f":"IF($B13=\"\",\"\",_xlfn.XLOOKUP($B13,Carreras!$I:$I,Carreras!$A:$A,0,0,1))","v":""},{"$f":"IF($B13=\"\",\"\",IF($S13=0,0,_xlfn.XLOOKUP($S13,Puntos!A:A,Puntos!B:B,TRUE)))","v":""},"",{"$f":"IF($B13=\"\",\"\",_xlfn.IFS(U13=0,0,U13=1,0,U13=2,50,U13=3,100,U13=4,150,U13=5,200,U13=6,250,U13=7,300,U13=8,350))","v":""},"",0]
[11,{"$f":"IF(Carreras!$K12=0,\"\",Carreras!$K12)","v":""},{"$f":"IF(B14=\"\",\"\",_xlfn.XLOOKUP(B14,Socios!A:A,Socios!B:B,FALSE,0,1))","v":""},{"$f":"IF(B14=\"\",\"\",_xlfn.XLOOKUP(B14,Socios!A:A,Socios!C:C,FALSE,0,1))","v":""},{"$f":"IF($B14=\"\",\"\",_xlfn.XLOOKUP($B14,Carreras!$B:$B,Carreras!$A:$A,0,0,1))","v":""},{"$f":"IF($B14=\"\",\"\",IF($E14=0,0,_xlfn.XLOOKUP($E14,Puntos!A:A,Puntos!B:B,TRUE)))","v":""},{"$f":"IF($B14=\"\",\"\",_xlfn.XLOOKUP($B14,Carreras!C:C,Carreras!A:A,0,0,1))","v":""},{"$f":"IF($B14=\"\",\"\",IF($G14=0,0,_xlfn.XLOOKUP($G14,Puntos!A:A,Puntos!B:B,TRUE)))","v":""},{"$f":"IF($B14=\"\",\"\",_xlfn.XLOOKUP($B14,Carreras!$D:$D,Carreras!$A:$A,0,0,1))","v":""},{"$f":"IF($B14=\"\",\"\",IF($I14=0,0,_xlfn.XLOOKUP($I14,Puntos!A:A,Puntos!B:B,TRUE)))","v":""},{"$f":"IF($B14=\"\",\"\",_xlfn.XLOOKUP($B14,Carreras!$E:$E,Carreras!$A:$A,0,0,1))","v":""},{"$f":"IF($B14=\"\",\"\",IF($K14=0,0,_xlfn.XLOOKUP($K14,Puntos!$A:$A,Puntos!$B:$B)))","v":""},{"$f":"IF($B14=\"\",\"\",_xlfn.XLOOKUP($B14,Carreras!F:F,Carreras!$A:$A,0,0,1))","v":""},{"$f":"IF($B14=\"\",\"\",IF($M14=0,0,_xlfn.XLOOKUP(M14,Puntos!A:A,Puntos!B:B,TRUE)))","v":""},{"$f":"IF($B14=\"\",\"\",_xlfn.XLOOKUP($B14,Carreras!$G:$G,Carreras!$A:$A,0,0,1))","v":""},{"$f":"IF($B14=\"\",\"\",IF($O14=0,0,_xlfn.XLOOKUP($O14,Puntos!A:A,Puntos!B:B,TRUE)))","v":""},{"$f":"IF($B14=\"\",\"\",_xlfn.XLOOKUP($B14,Carreras!$H:$H,Carreras!$A:$A,0,0,1))","v":""},{"$f":"IF($B14=\"\",\"\",IF($Q14=0,0,_xlfn.XLOOKUP($Q14,Puntos!A:A,Puntos!B:B,TRUE)))","v":""},{"$f":"IF($B14=\"\",\"\",_xlfn.XLOOKUP($B14,Carreras!$I:$I,Carreras!$A:$A,0,0,1))","v":""},{"$f":"IF($B14=\"\",\"\",IF($S14=0,0,_xlfn.XLOOKUP($S14,Puntos!A:A,Puntos!B:B,TRUE)))","v":""},"",{"$f":"IF($B14=\"\",\"\",_xlfn.IFS(U14=0,0,U14=1,0,U14=2,50,U14=3,100,U14=4,150,U14=5,200,U14=6,250,U14=7,300,U14=8,350))","v":""},"",0]
[12,{"$f":"IF(Carreras!$K13=0,\"\",Carreras!$K13)","v":""},{"$f":"IF(B15=\"\",\"\",_xlfn.XLOOKUP(B15,Socios!A:A,Socios!B:B,FALSE,0,1))","v":""},{"$f":"IF(B15=\"\",\"\",_xlfn.XLOOKUP(B15,Socios!A:A,Socios!C:C,FALSE,0,1))","v":""},{"$f":"IF($B15=\"\",\"\",_xlfn.XLOOKUP($B15,Carreras!$B:$B,Carreras!$A:$A,0,0,1))","v":""},{"$f":"IF($B15=\"\",\"\",IF($E15=0,0,_xlfn.XLOOKUP($E15,Puntos!A:A,Puntos!B:B,TRUE)))","v":""},{"$f":"IF($B15=\"\",\"\",_xlfn.XLOOKUP($B15,Carreras!C:C,Carreras!A:A,0,0,1))","v":""},{"$f":"IF($B15=\"\",\"\",IF($G15=0,0,_xlfn.XLOOKUP($G15,Puntos!A:A,Puntos!B:B,TRUE)))","v":""},{"$f":"IF($B15=\"\",\"\",_xlfn.XLOOKUP($B15,Carreras!$D:$D,Carreras!$A:$A,0,0,1))","v":""},{"$f":"IF($B15=\"\",\"\",IF($I15=0,0,_xlfn.XLOOKUP($I15,Puntos!A:A,Puntos!B:B,TRUE)))","v":""},{"$f":"IF($B15=\"\",\"\",_xlfn.XLOOKUP($B15,Carreras!$E:$E,Carreras!$A:$A,0,0,1))","v":""},{"$f":"IF($B15=\"\",\"\",IF($K15=0,0,_xlfn.XLOOKUP($K15,Puntos!$A:$A,Puntos!$B:$B)))","v":""},{"$f":"IF($B15=\"\",\"\",_xlfn.XLOOKUP($B15,Carreras!F:F,Carreras!$A:$A,0,0,1))","v":""},{"$f":"IF($B15=\"\",\"\",IF($M15=0,0,_xlfn.XLOOKUP(M15,Puntos!A:A,Puntos!B:B,TRUE)))","v":""},{"$f":"IF($B15=\"\",\"\",_xlfn.XLOOKUP($B15,Carreras!$G:$G,Carreras!$A:$A,0,0,1))","v":""},{"$f":"IF($B15=\"\",\"\",IF($O15=0,0,_xlfn.XLOOKUP($O15,Puntos!A:A,Puntos!B:B,TRUE)))","v":""},{"$f":"IF($B15=\"\",\"\",_xlfn.XLOOKUP($B15,Carreras!$H:$H,Carreras!$A:$A,0,0,1))","v":""},{"$f":"IF($B15=\"\",\"\",IF($Q15=0,0,_xlfn.XLOOKUP($Q15,Puntos!A:A,Puntos!B:B,TRUE)))","v":""},{"$f":"IF($B15=\"\",\"\",_xlfn.XLOOKUP($B15,Carreras!$I:$I,Carreras!$A:$A,0,0,1))","v":""},{"$f":"IF($B15=\"\",\"\",IF($S15=0,0,_xlfn.XLOOKUP($S15,Puntos!A:A,Puntos!B:B,TRUE)))","v":""},"",{"$f":"IF($B15=\"\",\"\",_xlfn.IFS(U15=0,0,U15=1,0,U15=2,50,U15=3,100,U15=4,150,U15=5,200,U15=6,250,U15=7,300,U15=8,350))","v":""},"",0]
{"$rows_left_out":89}
{"sheet":"Puntos","index":1,"n_rows":92,"n_cols":4,"rows_kept":92,"cut":false,"hidden":false,"merged":[]}
["Puesto","Puntos",null,"participantes"]
[1,640]
[2,613]
[3,587]
[4,562]
[5,538]
[6,515]
[7,493]
[8,472]
[9,452]
[10,433]
[11,414]
[12,396]
[13,379]
[14,363]
{"$rows_left_out":78}
{"sheet":"Socios","index":2,"n_rows":0,"n_cols":0,"rows_kept":0,"cut":false,"hidden":false,"merged":[]}

{"sheet":"Carreras","index":3,"n_rows":853,"n_cols":11,"rows_kept":853,"cut":false,"hidden":false,"merged":[]}
["ORDEN","CARRERA1","CARRERA2","CARRERA3","CARRERA4","CARRERA5","CARRERA6","CARRERA7","CARRERA8",null,"Participantes"]
[1,0,null,null,null,null,null,null,null,{"$f":"B2","v":0},0]
[{"$f":"A2+1","v":2},null,null,null,null,null,null,null,null,{"$f":"C2","v":0}]
[3,null,null,null,null,null,null,null,null,{"$f":"D2","v":0}]
[4,null,null,null,null,null,null,null,null,{"$f":"E2","v":0}]
[5,null,null,null,null,null,null,null,null,{"$f":"F2","v":0}]
[6,null,null,null,null,null,null,null,null,{"$f":"G2","v":0}]
[7,null,null,null,null,null,null,null,null,{"$f":"H2","v":0}]
[8,null,null,null,null,null,null,null,null,{"$f":"I2","v":0}]
[9,null,null,null,null,null,null,null,null,{"$f":"B3","v":0}]
[10,null,null,null,null,null,null,null,null,{"$f":"C3","v":0}]
[11,null,null,null,null,null,null,null,null,{"$f":"D3","v":0}]
[12,null,null,null,null,null,null,null,null,{"$f":"E3","v":0}]
[13,null,null,null,null,null,null,null,null,{"$f":"F3","v":0}]
[14,null,null,null,null,null,null,null,null,{"$f":"G3","v":0}]
{"$rows_left_out":838}